BDBM50366963 CHEMBL4160366
SMILES NC(=O)c1cc2ccccc2n1-c1cccc(OCC(O)=O)c1
InChI Key InChIKey=LNXHYFAARFFLFX-UHFFFAOYSA-N
Data  1 IC50
  Tab Delimited (TSV)   2D SDfile   Computed 3D by Vconf -m prep SDfile
Find this compound or compounds like it in BindingDB:
Activity Spreadsheet -- Enzyme Inhibition Constant Data from BindingDB
Found 1 hit for monomerid = 50366963
TargetGroup 10 secretory phospholipase A2(Homo sapiens (Human))
Astrazeneca
Curated by ChEMBL
LigandPNGBDBM50366963(CHEMBL4160366)
Affinity DataIC50:  2.69E+4nM. Assay description: Inhibition of recombinant human sPLA2-10 expressed in Escherichia coli BL21(DE3) using 1-palmitoyl-2-oleoyl-sn-glycero-3-phosphocholine as substrate ...
In DepthDetails ArticlePubMed